{"text_format":"1","workbook":"xlsx","n_sheets":5,"sheets":["志願書Ⅰ","志願書Ⅱ","プレゼンテーションシート","対応表","CODE"],"not_rendered":{"charts":0,"images":0,"macros":1,"external_links":0,"defined_names":110,"comments":0,"pivot_tables":0},"unopened":[],"bounds":{"document_bytes":16777216,"sheet_cells":100000,"rows_first":2000,"rows_last":500,"rows_between":2000,"halvings":0,"cell_chars":16384,"cell_head_chars":4096},"cells_cut":0,"cells_raw":0,"read":"whole","date_system":"1900"}

{"sheet":"志願書Ⅰ","index":0,"n_rows":57,"n_cols":30,"rows_kept":57,"cut":false,"hidden":false,"merged":[[19,2,19,6],[13,9,14,12],[15,9,15,10],[15,11,15,12],[50,16,52,30],[44,20,45,21],[13,0,13,8],[17,18,17,20],[18,19,18,20],[13,13,16,13],[13,14,13,17],[13,18,13,20],[15,14,15,17],[15,18,15,20],[14,7,14,8],[14,0,19,0],[17,2,17,6],[17,7,17,8],[19,7,19,8],[15,7,15,8],[52,7,52,8],[52,13,52,14],[36,6,36,15],[36,16,36,17],[44,0,52,0],[49,16,49,30],[46,7,46,8],[44,16,48,16],[51,7,51,8],[51,13,51,14],[44,5,45,6],[44,7,44,12],[45,7,45,8],[45,9,45,10],[45,11,45,12],[49,7,49,8],[50,7,50,8],[44,13,45,14],[47,7,47,8],[48,7,48,8],[39,8,40,9],[37,16,37,30],[38,24,41,24],[38,30,39,30],[57,19,57,21],[57,22,57,30],[44,15,52,15],[43,0,43,30],[46,22,46,30],[47,22,47,30],[48,22,48,30],[49,13,49,14],[50,13,50,14],[44,1,45,1],[44,2,45,3],[44,22,45,30],[44,4,45,4],[57,0,57,18],[56,0,56,20],[54,0,54,20],[56,21,56,30],[54,21,54,30],[44,17,45,17],[44,18,45,19],[38,17,42,19],[47,13,47,14],[48,13,48,14],[39,10,39,11],[38,16,42,16],[40,12,42,12],[40,13,42,13],[40,14,42,14],[46,13,46,14],[39,14,39,15],[32,5,32,6],[32,19,32,21],[32,23,32,25],[35,2,35,5],[35,6,35,15],[35,16,35,17],[35,18,35,30],[40,28,41,29],[39,2,40,2],[40,30,41,30],[41,2,42,2],[31,2,33,3],[31,4,31,16],[38,20,39,21],[34,0,34,30],[31,0,33,1],[31,19,31,30],[33,19,33,30],[36,18,36,30],[35,0,42,1],[40,23,42,23],[41,3,42,7],[41,8,42,9],[39,12,39,13],[27,12,27,13],[28,10,28,20],[29,10,29,20],[27,2,27,4],[27,6,27,9],[23,29,23,30],[25,0,25,22],[40,10,42,11],[40,20,42,20],[40,21,42,21],[40,22,42,22],[23,11,23,20],[26,2,26,9],[28,2,28,9],[29,2,29,9],[32,8,32,11],[32,13,32,16],[26,10,26,13],[32,27,32,30],[38,25,41,27],[38,28,39,29],[27,14,27,30],[37,2,38,9],[37,10,38,15],[33,12,33,13],[0,0,0,30],[2,2,2,8],[2,9,2,10],[4,2,4,8],[6,2,6,8],[6,9,6,10],[4,9,4,10],[5,2,5,8],[5,9,5,10],[3,2,3,8],[3,9,3,10],[2,0,6,0],[5,25,6,26],[5,22,6,24],[2,12,6,12],[4,22,4,30],[5,13,6,15],[5,16,6,17],[5,18,6,19],[5,20,6,21],[2,19,3,20],[2,24,3,25],[2,21,3,23],[12,13,12,20],[23,25,23,26],[23,27,23,28],[29,21,29,30],[30,0,30,30],[28,21,28,30],[31,17,33,18],[39,3,40,7],[26,14,26,22],[24,11,24,20],[24,23,24,24],[23,23,23,24],[25,30,26,30],[23,0,24,1],[23,21,24,22],[25,23,26,28],[25,29,26,29],[26,0,29,1],[24,2,24,10],[23,2,23,10],[27,10,27,11],[40,15,42,15],[38,22,39,23],[33,14,33,15],[18,2,18,6],[20,14,20,17],[20,18,20,20],[13,26,13,28],[14,26,14,28],[15,26,15,28],[16,26,16,28],[17,26,17,28],[18,26,18,28],[13,22,18,22],[13,23,15,25],[19,14,19,17],[19,18,19,20],[14,15,14,18],[14,19,14,20],[12,21,19,21],[17,14,17,17],[12,22,12,30],[13,29,13,30],[14,29,14,30],[15,29,15,30],[16,29,16,30],[17,29,17,30],[18,29,18,30],[8,0,10,0],[22,2,22,10],[22,11,22,20],[22,21,22,22],[22,23,22,30],[17,13,20,13],[16,23,18,25],[22,0,22,1],[11,0,11,30],[16,7,16,8],[16,14,16,17],[16,18,16,20],[18,15,18,18],[15,2,15,6],[16,2,16,6],[14,2,14,6],[18,7,18,8],[21,0,21,30],[20,21,20,33],[16,9,16,10],[16,11,16,12],[17,9,17,10],[17,11,17,12],[18,9,19,12],[1,27,1,30],[1,24,1,26],[1,21,1,23],[1,0,1,20],[12,0,12,12],[2,16,3,18],[2,26,3,28],[8,1,8,13],[10,1,10,13],[8,14,8,16],[10,14,10,16],[8,28,8,30],[10,28,10,30],[5,29,6,30],[5,27,6,28],[2,29,3,30],[2,13,3,15],[4,13,4,21],[9,1,9,13],[9,14,9,16],[9,17,9,27],[9,28,9,30],[8,17,8,27],[10,17,10,27]]}
[{"$f":"DBCS(TEXT(対応表!AG2,\"ggge年度\"))&\"　京都府公立学校教員採用選考試験　志願書Ⅰ\"","v":"令和５年度　京都府公立学校教員採用選考試験　志願書Ⅰ"}]
[null,null,null,null,null,null,null,null,null,null,null,null,null,null,null,null,null,null,null,null,null,"※受験番号",null,null,null,null,null,"※記入不要"]
["選考区分",1,"一般選考",null,null,null,null,null,null,null,null,null,"志願区分","いずれかに○をつけてください。",null,null,"一般採用枠",null,null,null,null,"北部採用枠",null,null,null,null,"小中連携推進枠"]
[null,2,"スペシャリスト特別選考"]
[null,3,"障害者特別選考",null,null,null,null,null,null,null,null,null,null,"第１希望",null,null,null,null,null,null,null,null,"第２希望"]
[null,4,"大学推薦特別選考",null,null,null,null,null,null,null,null,null,null,"校種等・\n教科(科目)",null,null,null,null,null,null,null,null,"校種等・\n教科(科目)"]
[null,5,"京都府「教師力養成講座」修了者に係る\n大学推薦特別選考"]
[]
["加点希望","小学校志願\n中学校・高等学校外国語（英語）免許所有者",null,null,null,null,null,null,null,null,null,null,null,null,null,null,null,"小学校・中学校・高等学校志願\n英語資格等所有者"]
[null,"小学校・中学校・高等学校志願\n特別支援免許所有者",null,null,null,null,null,null,null,null,null,null,null,null,null,null,null,"小学校・中学校・高等学校・特別支援志願\n情報資格等所有者"]
[null,"高等学校志願情報免許所有者",null,null,null,null,null,null,null,null,null,null,null,null,null,null,null,"国際貢献活動等経験者"]
[]
["一部免除希望",null,null,null,null,null,null,null,null,null,null,null,null,"過去２年間の免除について",null,null,null,null,null,null,null,null,"実技試験（該当校種及び教科志願者のみ記入）"]
["免除について下記１～６に○を付ける",null,null,null,null,null,null,null,null,"１、５を選んだ場合免除希望の科目に○をつけてください。",null,null,null,{"$f":"DBCS(TEXT(EDATE(DATE(YEAR(対応表!AG2)-1, MONTH(対応表!AG2), DAY(対応表!AG2)),-3),\"e\"))&\"\n年\n度\"","v":"４\n年\n度"},"免除あり",null,null,null,null,null,null,null,"中・高保体","３つのうち\n１つを選ぶ",null,null,"バスケットボール"]
["免除区分",1,"前年度合格試験",null,null,null,null,null,null,null,null,null,null,null,null,"免除区分",null,null,null,null,null,null,null,null,null,null,"バレーボール"]
[null,2,"大学推薦特別選考",null,null,null,null,null,null,"小論文",null,null,null,null,"免除なし",null,null,null,null,null,null,null,null,null,null,null,"サッカー"]
[null,3,"中・高外国語（英語）",null,null,null,null,null,null,"専門試験",null,null,null,null,"受験なし",null,null,null,null,null,null,null,null,"３つのうち\n１つを選ぶ",null,null,"柔道"]
[null,4,"京都府内講師等特例（京都市立除く）",null,null,null,null,null,null,"教職教養",null,null,null,{"$f":"DBCS(TEXT(EDATE(DATE(YEAR(対応表!AG2)-2, MONTH(対応表!AG2), DAY(対応表!AG2)),-3),\"e\"))&\"\n年\n度\"","v":"３\n年\n度"},"免除あり",null,null,null,null,null,null,null,null,null,null,null,"剣道"]
[null,5,"他府県現職",null,null,null,null,null,null,"※実際に免除される科目は受験票をご確認ください。",null,null,null,null,null,"免除区分",null,null,null,null,null,null,null,null,null,null,"ダンス"]
[null,6,"希望しない",null,null,null,null,null,null,null,null,null,null,null,"免除なし"]
[null,null,null,null,null,null,null,null,null,null,null,null,null,null,"受験なし"]
[]
["フリガナ",null,null,null,null,null,null,null,null,null,null,null,null,null,null,null,null,null,null,null,null,"性別",null,"生年月日"]
["氏名",null,"姓",null,null,null,null,null,null,null,null,"名",null,null,null,null,null,null,null,null,null,null,null,"元号",null,"年",null,"月",null,"日"]
[]
[null,null,null,null,null,null,null,null,null,null,null,null,null,null,null,null,null,null,null,null,null,null,null,{"$f":"TEXT(対応表!AG2,\"ggge年m月d日\")&\"\n現在の年齢\"","v":"令和5年4月1日\n現在の年齢"}]
["現住所",null,"郵便番号",null,null,null,null,null,null,null,"都道府県コード"]
[null,null,null,null,null,"－"]
[null,null,"市･区･郡･町･村名",null,null,null,null,null,null,null,"字･町名、丁目、番地、号地",null,null,null,null,null,null,null,null,null,null,"マンション･アパート名、棟･室番号、様方等"]
[]
[]
["電話番号",null,"自宅",null,"市外局番から記入すること",null,null,null,null,null,null,null,null,null,null,null,null,"携帯電話"]
[null,null,null,null,"（",null,null,"）",null,null,null,null,"－",null,null,null,null,null,null,null,null,null,"－",null,null,null,"－"]
[null,null,null,null,null,null,null,null,null,null,null,null,"〔自・呼（",null,null,null,"）方 〕"]
[]
["最終学校",null,"学校コード",null,null,null,"学校名",null,null,null,null,null,null,null,null,null,"学部\nコード",null,"学部名・専攻名等　　"]
[]
[null,null,"卒業区分",null,null,null,null,null,null,null,"卒業・修了（見込み）年月"]
[null,null,null,null,null,null,null,null,null,null,null,null,null,null,null,null,null,"現在の\n職業",null,null,"職種\nコード",null,"勤務先\nコード",null,null,"教職経験\nの有無",null,null,"あり"]
[null,null,1,"卒業（修了）見込",null,null,null,null,null,null,"元号",null,"年",null,"月"]
[null,null,null,null,null,null,null,null,null,null,null,null,null,null,null,null,null,null,null,null,null,null,null,null,null,null,null,null,"なし"]
[null,null,2,"既に卒業（修了）"]
[]
[]
["取得（見込み）教員免許状","番号","校種\n職種",null,"種別","教科(科目)\n・領域",null,"取得（見込）年月",null,null,null,null,null,"取得\nコード",null,null,"教職経験の状況","年度","職種\nコード",null,"勤務先\nコード",null,"当該年度の\n主な勤務先名称"]
[null,null,null,null,null,null,null,"元号",null,"年",null,"月"]
[null,1,null,null,null,null,null,null,null,null,null,null,null,null,null,null,null,{"$f":"TEXT(EDATE(DATE(YEAR(対応表!AG2)-1, MONTH(対応表!AG2), DAY(対応表!AG2)),-3),\"e\")","v":"4"}]
[null,2,null,null,null,null,null,null,null,null,null,null,null,null,null,null,null,{"$f":"TEXT(EDATE(DATE(YEAR(対応表!AG2)-2, MONTH(対応表!AG2), DAY(対応表!AG2)),-3),\"e\")","v":"3"}]
[null,3,null,null,null,null,null,null,null,null,null,null,null,null,null,null,null,{"$f":"TEXT(EDATE(DATE(YEAR(対応表!AG2)-3, MONTH(対応表!AG2), DAY(対応表!AG2)),-3),\"e\") & \"\n以前\"","v":"2\n以前"}]
[null,4,null,null,null,null,null,null,null,null,null,null,null,null,null,null,"試験に際して配慮を要する内容"]
[null,5]
[null,6]
[null,7]
[]
["京都府公立学校における講師任用に関する問い合わせをするために、\nこの志願書に記入された個人情報を利用することに同意しますか。\n（記入や同意の可否は、試験の合否に一切影響しません。）詳細はP.10を確認してください。"]
[]
["採用選考試験の第1次試験を合格し、第2次試験が不合格となった場合、\n本年度実施する任期付職員選考採用試験の筆記試験・面接試験の免除を希望しますか。\n（記入や希望の有無は、試験の合否に一切影響しません。）詳細はP.10を確認してください。　"]

{"sheet":"志願書Ⅱ","index":1,"n_rows":65,"n_cols":34,"rows_kept":65,"cut":false,"hidden":false,"merged":[[60,1,60,4],[60,5,60,7],[59,25,59,31],[59,32,59,33],[59,13,59,22],[59,23,59,24],[57,1,57,7],[58,1,58,4],[58,5,58,7],[59,1,59,4],[59,5,59,7],[57,13,57,22],[57,23,57,24],[57,25,57,31],[57,32,57,33],[58,13,58,22],[58,23,58,24],[58,25,58,31],[58,32,58,33],[64,29,64,35],[61,13,62,15],[61,16,61,18],[61,19,61,23],[61,24,61,26],[61,27,61,30],[62,16,62,18],[62,19,62,23],[62,24,62,26],[62,27,62,30],[53,15,53,23],[54,2,54,9],[54,10,54,11],[55,1,55,9],[55,10,55,11],[56,13,56,33],[50,10,50,11],[51,2,51,9],[51,10,51,11],[51,13,51,23],[52,2,52,9],[52,10,52,11],[52,13,53,14],[52,15,52,23],[53,2,53,9],[53,10,53,11],[45,30,54,34],[46,2,46,9],[46,10,46,11],[47,1,48,1],[47,2,48,9],[47,10,48,11],[47,13,47,21],[49,1,49,11],[50,2,50,9],[44,2,44,9],[44,10,44,11],[44,13,44,21],[45,2,45,9],[45,10,45,11],[45,24,45,29],[42,1,42,11],[42,13,42,19],[42,20,42,21],[43,2,43,9],[43,10,43,11],[43,13,43,19],[43,20,43,21],[45,19,46,21],[45,16,46,18],[45,13,46,15],[48,19,49,21],[48,16,49,18],[48,13,49,15],[46,24,46,29],[47,24,49,29],[40,2,40,10],[40,13,40,21],[40,24,43,24],[40,25,40,26],[40,27,40,32],[40,33,40,34],[41,13,41,19],[41,20,41,21],[41,25,43,32],[41,33,43,34],[35,1,37,6],[35,7,35,35],[36,7,36,8],[36,10,36,11],[36,13,36,14],[36,16,36,35],[37,7,37,8],[37,10,37,11],[37,13,37,14],[37,16,37,35],[32,29,33,31],[32,32,33,35],[33,1,33,2],[33,4,33,5],[33,7,33,8],[33,9,33,10],[32,1,32,2],[32,4,32,5],[32,7,32,8],[32,9,32,10],[32,11,33,24],[32,25,33,28],[30,29,31,31],[30,32,31,35],[31,1,31,2],[31,4,31,5],[31,7,31,8],[31,9,31,10],[30,1,30,2],[30,4,30,5],[30,7,30,8],[30,9,30,10],[30,11,31,24],[30,25,31,28],[28,29,29,31],[28,32,29,35],[29,1,29,2],[29,4,29,5],[29,7,29,8],[29,9,29,10],[28,1,28,2],[28,4,28,5],[28,7,28,8],[28,9,28,10],[28,11,29,24],[28,25,29,28],[26,29,27,31],[26,32,27,35],[27,1,27,2],[27,4,27,5],[27,7,27,8],[27,9,27,10],[26,1,26,2],[26,4,26,5],[26,7,26,8],[26,9,26,10],[26,11,27,24],[26,25,27,28],[24,29,25,31],[24,32,25,35],[25,1,25,2],[25,4,25,5],[25,7,25,8],[25,9,25,10],[24,1,24,2],[24,4,24,5],[24,7,24,8],[24,9,24,10],[24,11,25,24],[24,25,25,28],[22,29,23,31],[22,32,23,35],[23,1,23,2],[23,4,23,5],[23,7,23,8],[23,9,23,10],[22,1,22,2],[22,4,22,5],[22,7,22,8],[22,9,22,10],[22,11,23,24],[22,25,23,28],[20,29,21,31],[20,32,21,35],[21,1,21,2],[21,4,21,5],[21,7,21,8],[21,9,21,10],[20,1,20,2],[20,4,20,5],[20,7,20,8],[20,9,20,10],[20,11,21,24],[20,25,21,28],[18,29,19,31],[18,32,19,35],[19,1,19,2],[19,4,19,5],[19,7,19,8],[19,9,19,10],[18,1,18,2],[18,4,18,5],[18,7,18,8],[18,9,18,10],[18,11,19,24],[18,25,19,28],[16,29,17,31],[16,32,17,35],[17,1,17,2],[17,4,17,5],[17,7,17,8],[17,9,17,10],[16,1,16,2],[16,4,16,5],[16,7,16,8],[16,9,16,10],[16,11,17,24],[16,25,17,28],[14,29,15,31],[14,32,15,35],[15,1,15,2],[15,4,15,5],[15,7,15,8],[15,9,15,10],[14,1,14,2],[14,4,14,5],[14,7,14,8],[14,9,14,10],[14,11,15,24],[14,25,15,28],[12,29,13,31],[12,32,13,35],[13,1,13,2],[13,4,13,5],[13,7,13,8],[13,9,13,10],[12,1,12,2],[12,4,12,5],[12,7,12,8],[12,9,12,10],[12,11,13,24],[12,25,13,28],[10,29,11,31],[10,32,11,35],[11,1,11,2],[11,4,11,5],[11,7,11,8],[11,9,11,10],[10,1,10,2],[10,4,10,5],[10,7,10,8],[10,9,10,10],[10,11,11,24],[10,25,11,28],[8,29,9,31],[8,32,9,35],[9,1,9,2],[9,4,9,5],[9,7,9,8],[9,9,9,10],[8,1,8,2],[8,4,8,5],[8,7,8,8],[8,9,8,10],[8,11,9,24],[8,25,9,28],[0,1,0,34],[1,1,1,35],[2,1,3,35],[4,1,5,10],[4,11,5,24],[4,25,5,28],[4,29,5,31],[4,32,5,35],[6,29,7,31],[6,32,7,35],[7,1,7,2],[7,4,7,5],[7,7,7,8],[7,9,7,10],[6,1,6,2],[6,4,6,5],[6,7,6,8],[6,9,6,10],[6,11,7,24],[6,25,7,28]]}
[null,{"$f":"DBCS(TEXT(対応表!AG2,\"ggge年度\"))&\"　京都府公立学校教員採用選考試験　志願書Ⅱ\"","v":"令和５年度　京都府公立学校教員採用選考試験　志願書Ⅱ"}]
[null,"※新しいものから就職年次順に勤務先すべてを記入してください。"]
[null,"職　　　　　歴"]
[]
[null,"期　　間",null,null,null,null,null,null,null,null,null,"勤　　務　　先",null,null,null,null,null,null,null,null,null,null,null,null,null,"職種・職名等",null,null,null,"教職の場合\n教科(科目)等",null,null,"正職員・\n臨時職員の別"]
[]
[null,null,null,"年",null,null,"月",null,null,"日から"]
[null,null,null,"年",null,null,"月",null,null,"日まで"]
[null,null,null,"年",null,null,"月",null,null,"日から"]
[null,null,null,"年",null,null,"月",null,null,"日まで"]
[null,null,null,"年",null,null,"月",null,null,"日から"]
[null,null,null,"年",null,null,"月",null,null,"日まで"]
[null,null,null,"年",null,null,"月",null,null,"日から"]
[null,null,null,"年",null,null,"月",null,null,"日まで"]
[null,null,null,"年",null,null,"月",null,null,"日から"]
[null,null,null,"年",null,null,"月",null,null,"日まで"]
[null,null,null,"年",null,null,"月",null,null,"日から"]
[null,null,null,"年",null,null,"月",null,null,"日まで"]
[null,null,null,"年",null,null,"月",null,null,"日から"]
[null,null,null,"年",null,null,"月",null,null,"日まで"]
[null,null,null,"年",null,null,"月",null,null,"日から"]
[null,null,null,"年",null,null,"月",null,null,"日まで"]
[null,null,null,"年",null,null,"月",null,null,"日から"]
[null,null,null,"年",null,null,"月",null,null,"日まで"]
[null,null,null,"年",null,null,"月",null,null,"日から"]
[null,null,null,"年",null,null,"月",null,null,"日まで"]
[null,null,null,"年",null,null,"月",null,null,"日から"]
[null,null,null,"年",null,null,"月",null,null,"日まで"]
[null,null,null,"年",null,null,"月",null,null,"日から"]
[null,null,null,"年",null,null,"月",null,null,"日まで"]
[null,null,null,"年",null,null,"月",null,null,"日から"]
[null,null,null,"年",null,null,"月",null,null,"日まで"]
[null,null,null,"年",null,null,"月",null,null,"日から"]
[null,null,null,"年",null,null,"月",null,null,"日まで"]
[null,"刑罰、処分歴"]
[null,null,null,null,null,null,null,"ありの場合、時期及び種類"]
[null,null,null,null,null,null,null,null,null,"年",null,null,"月",null,null,"日"]
[null,null,null,null,null,null,null,null,null,"年",null,null,"月",null,null,"日"]
[]
[]
[null,null,"整理カード",null,null,null,null,null,null,null,null,null,null,"志　願　区　分",null,null,null,null,null,null,null,null,null,null,"氏名","フリガナ",null,{"$f":"志願書Ⅰ!C23&\" \"&志願書Ⅰ!L23","v":" "},null,null,null,null,null,"性別"]
[null,null,null,null,null,null,null,null,null,null,null,null,null,"一般採用枠",null,null,null,null,null,null,{"$f":"志願書Ⅰ!T3","v":0},null,null,null,null,{"$f":"志願書Ⅰ!C25 & \"　\" & 志願書Ⅰ!L25","v":"　"},null,null,null,null,null,null,null,{"$f":"志願書Ⅰ!V24","v":0}]
[null,"選　考　区　分",null,null,null,null,null,null,null,null,null,null,null,"北部採用枠",null,null,null,null,null,null,{"$f":"志願書Ⅰ!Y3","v":0}]
[null,1,"一般選考",null,null,null,null,null,null,null,{"$f":"志願書Ⅰ!J3","v":0},null,null,"小中連携推進枠",null,null,null,null,null,null,{"$f":"志願書Ⅰ!AD3","v":0}]
[null,2,"スペシャリスト特別選考",null,null,null,null,null,null,null,{"$f":"志願書Ⅰ!J4","v":0},null,null,"第１希望"]
[null,3,"障害者特別選考",null,null,null,null,null,null,null,{"$f":"志願書Ⅰ!J5","v":0},null,null,{"$f":"志願書Ⅰ!Q6","v":0},null,null,{"$f":"志願書Ⅰ!S6","v":0},null,null,{"$f":"志願書Ⅰ!U6","v":0},null,null,null,null,"受験番号",null,null,null,null,null,"（写真貼付箇所）\n\n上半身、脱帽、\n無背景、正面向き、\n枠に収まる大きさ\n６ヶ月以内に\n撮影したもの"]
[null,4,"大学推薦特別選考",null,null,null,null,null,null,null,{"$f":"志願書Ⅰ!J6","v":0},null,null,null,null,null,null,null,null,null,null,null,null,null,"※"]
[null,5,"京都府「教師力養成講座」修了者に係る大学推薦特別選考",null,null,null,null,null,null,null,{"$f":"志願書Ⅰ!J7","v":0},null,null,"第２希望",null,null,null,null,null,null,null,null,null,null,{"$f":"志願書Ⅰ!Y2","v":0}]
[null,null,null,null,null,null,null,null,null,null,null,null,null,{"$f":"志願書Ⅰ!Z6","v":0},null,null,{"$f":"志願書Ⅰ!AB6","v":0},null,null,{"$f":"志願書Ⅰ!AD6","v":0}]
[null,"免　除　区　分"]
[null,1,"前年度合格試験",null,null,null,null,null,null,null,{"$f":"志願書Ⅰ!H15","v":0}]
[null,2,"大学推薦特別選考",null,null,null,null,null,null,null,{"$f":"志願書Ⅰ!H16","v":0},null,null,"実技試験"]
[null,3,"中・高外国語（英語）",null,null,null,null,null,null,null,{"$f":"志願書Ⅰ!H17","v":0},null,null,"中高\n保体",null,{"$f":"IF(志願書Ⅰ!AD14=\"○\",志願書Ⅰ!AA14,IF(志願書Ⅰ!AD15=\"○\",志願書Ⅰ!AA15,IF(志願書Ⅰ!AD16=\"○\",志願書Ⅰ!AA16,\"\")))","v":""}]
[null,4,"京都府内講師等特例（京都市立除く）",null,null,null,null,null,null,null,{"$f":"志願書Ⅰ!H18","v":0},null,null,null,null,{"$f":"IF(志願書Ⅰ!AD17=\"○\",志願書Ⅰ!AA17,IF(志願書Ⅰ!AD18=\"○\",志願書Ⅰ!AA18,IF(志願書Ⅰ!AD19=\"○\",志願書Ⅰ!AA19,\"\")))","v":""}]
[null,5,"他府県現職",null,null,null,null,null,null,null,{"$f":"志願書Ⅰ!H19","v":0}]
[null,"希望しない",null,null,null,null,null,null,null,null,{"$f":"志願書Ⅰ!H20","v":0}]
[null,null,null,null,null,null,null,null,null,null,null,null,null,"加点希望"]
[null,"免除科目",null,null,null,null,null,null,null,null,null,null,null,"小　外国語（英語）免許所有者",null,null,null,null,null,null,null,null,null,{"$f":"志願書Ⅰ!O9","v":0},null,"英語資格等所有者",null,null,null,null,null,null,{"$f":"志願書Ⅰ!AC9","v":0}]
[null,"小論文",null,null,null,{"$f":"志願書Ⅰ!L16","v":0},null,null,null,null,null,null,null,"小中高　特別支援免許所有者",null,null,null,null,null,null,null,null,null,{"$f":"志願書Ⅰ!O10","v":0},null,"情報資格等所有者",null,null,null,null,null,null,{"$f":"志願書Ⅰ!AC10","v":0}]
[null,"専門試験",null,null,null,{"$f":"志願書Ⅰ!L17","v":0},null,null,null,null,null,null,null,"高　情報免許所有者",null,null,null,null,null,null,null,null,null,{"$f":"志願書Ⅰ!O11","v":0},null,"国際貢献活動等経験者",null,null,null,null,null,null,{"$f":"志願書Ⅰ!AC11","v":0}]
[null,"教職教養",null,null,null,{"$f":"志願書Ⅰ!L18","v":0}]
[null,null,null,null,null,null,null,null,null,null,null,null,null,"※出欠調",null,null,"面　接",null,null,"出・欠",null,null,null,null,"一般教養",null,null,"出・免・欠"]
[null,null,null,null,null,null,null,null,null,null,null,null,null,null,null,null,"小論文",null,null,"出・免・欠",null,null,null,null,"専門教科",null,null,"出・免・欠"]
[]
[null,null,null,null,null,null,null,null,null,null,null,null,null,null,null,null,null,null,null,null,null,null,null,null,null,null,null,null,null,"※記入不要"]

{"sheet":"プレゼンテーションシート","index":2,"n_rows":34,"n_cols":24,"rows_kept":34,"cut":false,"hidden":false,"merged":[[36,17,36,19],[36,20,36,23],[38,13,38,16],[38,17,38,19],[38,20,38,23],[37,13,37,16],[37,17,37,19],[37,20,37,23],[33,1,34,10],[33,12,39,12],[33,13,33,16],[33,17,33,19],[33,20,33,23],[34,13,34,16],[34,17,34,19],[34,20,34,23],[35,0,39,11],[35,13,35,16],[35,17,35,19],[35,20,35,23],[36,13,36,16],[39,13,39,16],[39,17,39,19],[39,20,39,23],[13,0,20,11],[13,12,20,23],[21,0,21,23],[22,1,22,10],[22,13,22,22],[23,0,32,11],[23,12,32,23],[10,10,10,11],[10,12,10,21],[10,22,10,23],[11,0,11,23],[12,0,12,11],[12,12,12,23],[8,0,10,0],[8,1,8,9],[8,10,8,11],[8,12,8,21],[8,22,8,23],[9,1,9,9],[9,10,9,11],[9,12,9,21],[9,22,9,23],[10,1,10,9],[5,18,5,23],[6,2,6,8],[6,9,6,10],[6,12,7,13],[6,14,7,15],[6,16,7,17],[6,18,7,19],[6,20,7,21],[6,22,7,23],[7,2,7,8],[3,19,4,19],[3,20,4,22],[3,23,4,23],[4,2,4,8],[4,9,4,10],[3,15,4,15],[3,0,7,0],[3,2,3,8],[3,9,3,10],[3,11,7,11],[3,12,4,14],[5,2,5,8],[5,9,5,10],[5,12,5,17],[7,9,7,10],[3,16,4,18],[0,0,0,23],[1,0,2,0],[1,1,1,2],[1,3,1,15],[1,16,1,20],[1,21,1,23],[2,1,2,15],[2,16,2,23]]}
[{"$f":"DBCS(TEXT(対応表!AG2,\"ggge年度\"))&\"　京都府公立学校教員採用選考試験プレゼンテーションシート\"","v":"令和５年度　京都府公立学校教員採用選考試験プレゼンテーションシート"}]
["氏名","フリガナ",null,{"$f":"志願書Ⅰ!C23&\" \"&志願書Ⅰ!L23","v":" "},null,null,null,null,null,null,null,null,null,null,null,null,"※受験番号",null,null,null,null,"※記入不要"]
[null,{"$f":"志願書Ⅰ!C25 & \"　\" & 志願書Ⅰ!L25","v":"　"},null,null,null,null,null,null,null,null,null,null,null,null,null,null,{"$f":"志願書Ⅰ!Y2","v":0}]
["選\n考\n区\n分","１","一般選考",null,null,null,null,null,null,{"$f":"志願書Ⅰ!J3","v":0},null,"志願区分","一般採用枠",null,null,{"$f":"志願書Ⅰ!T3","v":0},"北部採用枠",null,null,{"$f":"志願書Ⅰ!Y3","v":0},"小中連携推進枠",null,null,{"$f":"志願書Ⅰ!AD3","v":0}]
[null,2,"スペシャリスト特別選考",null,null,null,null,null,null,{"$f":"志願書Ⅰ!J4","v":0}]
[null,3,"障害者特別選考",null,null,null,null,null,null,{"$f":"志願書Ⅰ!J5","v":0},null,null,"第１希望",null,null,null,null,null,"第２希望"]
[null,4,"大学推薦特別選考",null,null,null,null,null,null,{"$f":"志願書Ⅰ!J6","v":0},null,null,{"$f":"志願書Ⅰ!Q6","v":0},null,{"$f":"志願書Ⅰ!S6","v":0},null,{"$f":"志願書Ⅰ!U6","v":0},null,{"$f":"志願書Ⅰ!Z6","v":0},null,{"$f":"志願書Ⅰ!AB6","v":0},null,{"$f":"志願書Ⅰ!AD6","v":0}]
[null,5,"京都府「教師力養成講座」修了者に\n係る大学推薦特別選考",null,null,null,null,null,null,{"$f":"志願書Ⅰ!J7","v":0}]
["加点希望","小学校志願\n中学校・高等学校外国語（英語）免許所有者",null,null,null,null,null,null,null,null,{"$f":"志願書Ⅰ!O9","v":0},null,"小学校・中学校・高等学校志願\n英語資格等所有者",null,null,null,null,null,null,null,null,null,{"$f":"志願書Ⅰ!AC9","v":0}]
[null,"小学校・中学校・高等学校志願\n特別支援免許所有者",null,null,null,null,null,null,null,null,{"$f":"志願書Ⅰ!O10","v":0},null,"小学校・中学校・高等学校・特別支援志願\n情報資格等所有者",null,null,null,null,null,null,null,null,null,{"$f":"志願書Ⅰ!AC10","v":0}]
[null,"高等学校志願情報免許所有者",null,null,null,null,null,null,null,null,{"$f":"志願書Ⅰ!O11","v":0},null,"国際貢献活動等経験者",null,null,null,null,null,null,null,null,null,{"$f":"志願書Ⅰ!AC11","v":0}]
["志　　望　　理　　由"]
["教員を志望する理由",null,null,null,null,null,null,null,null,null,null,null,"京都府を志望する理由"]
[]
[]
[]
[]
[]
[]
[]
[]
["自   己   ア   ピ   ー   ル  "]
[null,"これまでの経験や特技、長所等について挙げ、自分が教員としてそれらをどのように活かそうと思うのか、書いてください。",null,null,null,null,null,null,null,null,null,null,null,"教員を志望するにあたり、今自分が取り組んでいることについて書いてください。"]
[]
[]
[]
[]
[]
[]
[]
[]
[]
[]
[null,"現在取得している資格とその取得時期について具体的に書いてください。",null,null,null,null,null,null,null,null,null,null,"英語資格","資格等名称",null,null,null,"級・得点",null,null,"取得年月日"]

{"sheet":"対応表","index":3,"n_rows":95,"n_cols":34,"rows_kept":95,"cut":false,"hidden":true,"merged":[[1,0,2,0],[1,1,1,5],[9,0,11,0],[9,1,9,15],[10,1,10,3],[10,4,10,6],[10,7,10,9],[10,10,10,12],[10,13,10,15],[45,0,46,0],[45,1,45,30],[80,0,81,0],[80,1,80,30],[91,0,92,0],[91,1,91,30]]}
["◆志願区分",null,null,null,null,null,null,null,null,null,null,null,null,null,null,null,null,null,null,"選考区分","志願区分","第１希望","第２希望","実技試験１","実技試験２",null,"連結コード",null,null,"個人情報利用",null,null,"発令日","生年月日"]
["志願区分","選考区分",null,null,null,null,null,null,null,null,null,null,null,null,null,null,null,null,null,{"$f":"IF(COUNTIF(志願書Ⅰ!J3:K7,\"○\")=1,INDIRECT(\"志願書Ⅰ!B\" & (MATCH(\"○\",志願書Ⅰ!J3:J7,0)+2)),IF(COUNTIF(志願書Ⅰ!J3:K7,\"○\")>1,\"OVER\",\"NULL\"))","v":"NULL"},{"$f":"IF(AND(志願書Ⅰ!T3=\"\",志願書Ⅰ!Y3=\"○\",志願書Ⅰ!AD3=\"○\"),99,IF(COUNTIF(志願書Ⅰ!Q3:AE4,\"○\")=1,MATCH(\"○\",志願書Ⅰ!Q3:AE3,0),IF(COUNTIF(志願書Ⅰ!Q3:AE4,\"○\")>0,\"OVER\",\"NULL\")))","v":"NULL"},{"$f":"IF(志願書Ⅰ!Q6<>\"\",IF(志願書Ⅰ!S6<>\"\",IF(志願書Ⅰ!U6<>\"\",志願書Ⅰ!Q6 & 志願書Ⅰ!S6 & 志願書Ⅰ!U6,\"NULL\"),\"NULL\"),\"NULL\")","v":"NULL"},{"$f":"IF(志願書Ⅰ!Z6<>\"\",IF(志願書Ⅰ!AB6<>\"\",IF(志願書Ⅰ!AD6<>\"\",志願書Ⅰ!Z6 & 志願書Ⅰ!AB6 & 志願書Ⅰ!AD6,\"NULL\"),\"NULL\"),\"NULL\")","v":"NULL"},{"$f":"IF(COUNTIF(志願書Ⅰ!AD14:AD16,\"○\")=1,INDIRECT(\"志願書Ⅰ!AA\" & (MATCH(\"○\",志願書Ⅰ!AD14:AD16,0)+14)),IF(COUNTIF(志願書Ⅰ!AD14:AD16,\"○\")>1,\"OVER\",\"NULL\"))","v":"NULL"},{"$f":"IF(COUNTIF(志願書Ⅰ!AD17:AE19,\"○\")=1,INDIRECT(\"志願書Ⅰ!AA\" & (MATCH(\"○\",志願書Ⅰ!AD17:AD19,0)+16)),IF(COUNTIF(志願書Ⅰ!AD17:AE19,\"○\")>1,\"OVER\",\"NULL\"))","v":"NULL"},null,"都道府県コード",{"$f":"志願書Ⅰ!K28 & 志願書Ⅰ!M28","v":""},null,"同意する",false,null,"2023-04-01"]
[null,"一般採用枠","スペシャリスト","障碍者特別選考","大学推薦","教師力養成講座",null,null,null,null,null,null,null,null,null,null,null,null,null,null,null,null,null,null,null,null,"学校コード",{"$f":"志願書Ⅰ!C37 & 志願書Ⅰ!D37 & 志願書Ⅰ!E37 &志願書Ⅰ!F37","v":""},null,"同意しない",false]
["一般","○","○","○","○","○",null,null,null,null,null,null,null,null,null,null,null,null,null,null,null,null,null,null,null,null,"現在職業：職種",{"$f":"志願書Ⅰ!U41 & 志願書Ⅰ!V41","v":""}]
["北部","○",null,null,"○","○",null,null,null,null,null,null,null,null,null,null,null,null,null,null,null,null,null,null,null,null,"現在職業：勤務地",{"$f":"志願書Ⅰ!W41 &志願書Ⅰ!X41","v":""},null,"任期付き職員免除"]
["小中連携","○",null,null,"○","○",null,null,null,null,null,null,null,null,null,null,null,null,null,"免除区分","卒業区分",null,null,null,null,null,"教員免許：校種1",{"$f":"志願書Ⅰ!C47 &志願書Ⅰ!D47","v":""},null,"希望する",false]
[null,null,null,null,null,null,null,null,null,null,null,null,null,null,null,null,null,null,null,{"$f":"IF(COUNTIF(志願書Ⅰ!H15:I20,\"○\")=1,INDIRECT(\"志願書Ⅰ!B\" & (MATCH(\"○\",志願書Ⅰ!H15:H20,0)+14)),IF(COUNTIF(志願書Ⅰ!H15:I20,\"○\")>1,\"OVER\",\"NULL\"))","v":"NULL"},{"$f":"IF(COUNTIF(志願書Ⅰ!I40:J43,\"○\")=1,INDIRECT(\"志願書Ⅰ!C\" & (MATCH(\"○\",志願書Ⅰ!I40:I43,0)+39)),IF(COUNTIF(志願書Ⅰ!I40:J43,\"○\")>1,\"OVER\",\"NULL\"))","v":"NULL"},null,null,null,null,null,"教員免許：校種2",{"$f":"志願書Ⅰ!C48 &志願書Ⅰ!D48","v":""},null,"希望しない",false]
[null,null,null,null,null,null,null,null,null,null,null,null,null,null,null,null,null,null,null,null,null,null,null,null,null,null,"教員免許：校種3",{"$f":"志願書Ⅰ!C49 &志願書Ⅰ!D49","v":""}]
["◆第１希望可能教科",null,null,null,null,null,null,null,null,null,null,null,null,null,null,null,null,null,null,null,null,null,null,null,null,null,"教員免許：校種4",{"$f":"志願書Ⅰ!C50 &志願書Ⅰ!D50","v":""},null,"刑罰・処分歴"]
["第１希望\n可能教科","選考区分",null,null,null,null,null,null,null,null,null,null,null,null,null,null,null,null,null,null,null,null,null,null,null,null,"教員免許：校種5",{"$f":"志願書Ⅰ!C51 & 志願書Ⅰ!D51","v":""},null,"あり",false]
[null,{"$f":"B3","v":"一般採用枠"},null,null,{"$f":"C3","v":"スペシャリスト"},null,null,{"$f":"D3","v":"障碍者特別選考"},null,null,{"$f":"E3","v":"大学推薦"},null,null,{"$f":"F3","v":"教師力養成講座"},null,null,null,null,null,null,null,null,null,null,null,null,"教員免許：校種6",{"$f":"志願書Ⅰ!C52 &志願書Ⅰ!D52","v":""},null,"なし",false]
[null,{"$f":"A4","v":"一般"},{"$f":"A5","v":"北部"},{"$f":"A6","v":"小中連携"},{"$f":"A4","v":"一般"},{"$f":"A5","v":"北部"},{"$f":"A6","v":"小中連携"},{"$f":"A4","v":"一般"},{"$f":"A5","v":"北部"},{"$f":"A6","v":"小中連携"},{"$f":"A4","v":"一般"},{"$f":"A5","v":"北部"},{"$f":"A6","v":"小中連携"},{"$f":"A4","v":"一般"},{"$f":"A5","v":"北部"},{"$f":"A6","v":"小中連携"},null,null,null,null,null,null,null,null,null,null,"教員免許：校種7",{"$f":"志願書Ⅰ!C53 & 志願書Ⅰ!D53","v":""}]
["小学校","○","○","○",null,null,null,"○",null,null,"○","○","○","○","○","○",null,null,null,null,null,null,null,null,null,null,"教職経験：職種1",{"$f":"志願書Ⅰ!S47 & 志願書Ⅰ!T47","v":""}]
["中国語","○","○",null,null,null,null,"○",null,null,"○","○",null,"○","○",null,null,null,null,null,null,null,null,null,null,null,"教職経験：職種2",{"$f":"志願書Ⅰ!S48 & 志願書Ⅰ!T48","v":""}]
["中社会","○","○",null,null,null,null,"○",null,null,"○","○",null,"○","○",null,null,null,null,null,null,null,null,null,null,null,"教職経験：職種3",{"$f":"志願書Ⅰ!S49 &志願書Ⅰ!T49","v":""}]
["中数学","○","○","○",null,null,null,"○",null,null,"○","○","○","○","○","○",null,null,null,null,null,null,null,null,null,null,"教職経験：勤務地1",{"$f":"志願書Ⅰ!U47 &志願書Ⅰ!V47","v":""}]
["中理科","○","○","○","○",null,null,"○",null,null,"○","○","○","○","○","○",null,null,null,null,null,null,null,null,null,null,"教職経験：勤務地2",{"$f":"志願書Ⅰ!U48 & 志願書Ⅰ!V48","v":""}]
["中音楽","○",null,null,null,null,null,"○",null,null,"○",null,null,null,null,null,null,null,null,null,null,null,null,null,null,null,"教職経験：勤務地3",{"$f":"志願書Ⅰ!U49 &志願書Ⅰ!V49","v":""}]
["中美術","○","○",null,null,null,null,"○",null,null,"○","○",null,null,null,null,null,null,null,null,null,null,null,null,null,null,"教職経験：有無",{"$f":"IF(COUNTIF(志願書Ⅰ!AE39:AE42,\"○\")=1,INDIRECT(\"志願書Ⅰ!AC\" & (MATCH(\"○\",志願書Ⅰ!AE39:AE42,0)+37)),IF(COUNTIF(志願書Ⅰ!AE39:AE42,\"○\")>1,\"OVER\",\"NULL\"))","v":"NULL"}]
["中保体","○",null,null,"○",null,null,"○",null,null,"○"]
["中技術","○",null,"○",null,null,null,"○",null,null,"○",null,"○"]
["中家庭","○",null,null,null,null,null,"○",null,null,"○"]
["中英語","○","○","○","-",null,null,"○",null,null,"○","○","○","○","○","○"]
["高国語","○","○",null,null,null,null,"○",null,null,"○","○",null,"○","○"]
["高地公","○","○",null,null,null,null,"○",null,null,"○","○",null,"○","○"]
["高数学","○","○",null,null,null,null,"○",null,null,"○","○",null,"○","○"]
["高理科","○","○",null,"○",null,null,"○",null,null,"○","○",null,"○","○"]
["高保体","○",null,null,"○",null,null,"○",null,null,"○"]
["高音楽","-",null,null,null,null,null,"-",null,null,"-"]
["高美術","○","○",null,null,null,null,"○",null,null,"○","○"]
["高書道","-",null,null,null,null,null,"○",null,null,"○"]
["高英語","○","○",null,"-",null,null,"○",null,null,"○","○",null,"○","○"]
["高家庭","○",null,null,null,null,null,"○",null,null,"○"]
["高情報","○",null,null,"○",null,null,"○",null,null,"○"]
["高農業","○",null,null,"○",null,null,"○",null,null,"○"]
["高工業","○",null,null,"○",null,null,"○",null,null,"○"]
["高商業","○",null,null,null,null,null,"○",null,null,"○"]
["高福祉","○",null,null,null,null,null,"○",null,null,"○"]
["高水産","-",null,null,null,null,null,"-",null,null,"-"]
["特支校","○","○",null,null,null,null,"○",null,null,"○","○",null,"○","○"]
["養教諭","○",null,null,null,null,null,"○",null,null,"○"]
["栄教諭","○",null,null,null,null,null,"○",null,null,"○"]
[]
[]
["◆第２希望可能教科"]
["第２希望\n可能教科","第１希望指定"]
[null,{"$f":"$A$13","v":"小学校"},{"$f":"$A$14","v":"中国語"},{"$f":"$A$15","v":"中社会"},{"$f":"$A$16","v":"中数学"},{"$f":"$A$17","v":"中理科"},{"$f":"$A$18","v":"中音楽"},{"$f":"$A$19","v":"中美術"},{"$f":"$A$20","v":"中保体"},{"$f":"$A$21","v":"中技術"},{"$f":"$A$22","v":"中家庭"},{"$f":"$A$23","v":"中英語"},{"$f":"$A$24","v":"高国語"},{"$f":"$A$25","v":"高地公"},{"$f":"$A$26","v":"高数学"},{"$f":"$A$27","v":"高理科"},{"$f":"$A$28","v":"高保体"},{"$f":"$A$29","v":"高音楽"},{"$f":"$A$30","v":"高美術"},{"$f":"$A$31","v":"高書道"},{"$f":"$A$32","v":"高英語"},{"$f":"$A$33","v":"高家庭"},{"$f":"$A$34","v":"高情報"},{"$f":"$A$35","v":"高農業"},{"$f":"$A$36","v":"高工業"},{"$f":"$A$37","v":"高商業"},{"$f":"$A$38","v":"高福祉"},{"$f":"$A$39","v":"高水産"},{"$f":"$A$40","v":"特支校"},{"$f":"$A$41","v":"養教諭"},{"$f":"$A$42","v":"栄教諭"}]
[{"$f":"$A$13","v":"小学校"},null,"○","○","○","○","○","○","○","○","○","○"]
[{"$f":"$A$14","v":"中国語"},null,null,null,null,null,null,null,null,null,null,null,"○"]
[{"$f":"$A$15","v":"中社会"},null,null,null,null,null,null,null,null,null,null,null,null,"○"]
[{"$f":"$A$16","v":"中数学"},null,null,null,null,null,null,null,null,null,null,null,null,null,"○"]
[{"$f":"$A$17","v":"中理科"},null,null,null,null,null,null,null,null,null,null,null,null,null,null,"○"]
[{"$f":"$A$18","v":"中音楽"},null,null,null,null,null,null,null,null,null,null,null,null,null,null,null,null,"○"]
[{"$f":"$A$19","v":"中美術"},null,null,null,null,null,null,null,null,null,null,null,null,null,null,null,null,null,"○"]
[{"$f":"$A$20","v":"中保体"},null,null,null,null,null,null,null,null,null,null,null,null,null,null,null,"○"]
[{"$f":"$A$21","v":"中技術"}]
[{"$f":"$A$22","v":"中家庭"},null,null,null,null,null,null,null,null,null,null,null,null,null,null,null,null,null,null,null,null,"○"]
[{"$f":"$A$23","v":"中英語"},null,null,null,null,null,null,null,null,null,null,null,null,null,null,null,null,null,null,null,"○"]
[{"$f":"$A$24","v":"高国語"}]
[{"$f":"$A$25","v":"高地公"}]
[{"$f":"$A$26","v":"高数学"}]
[{"$f":"$A$27","v":"高理科"},null,null,null,null,"◎"]
[{"$f":"$A$28","v":"高保体"},null,null,null,null,null,null,null,"◎"]
[{"$f":"$A$29","v":"高音楽"},null,null,null,null,null,"　－　"]
[{"$f":"$A$30","v":"高美術"},null,null,null,null,null,null,"○"]
[{"$f":"$A$31","v":"高書道"}]
[{"$f":"$A$32","v":"高英語"},null,null,null,null,null,null,null,null,null,null,"　－　"]
[{"$f":"$A$33","v":"高家庭"},null,null,null,null,null,null,null,null,null,"○"]
[{"$f":"$A$34","v":"高情報"}]
[{"$f":"$A$35","v":"高農業"}]
[{"$f":"$A$36","v":"高工業"}]
[{"$f":"$A$37","v":"高商業"}]
[{"$f":"$A$38","v":"高福祉"}]
[{"$f":"$A$39","v":"高水産"}]
[{"$f":"$A$40","v":"特支校"}]
[{"$f":"$A$41","v":"養教諭"}]
[{"$f":"$A$42","v":"栄教諭"}]
[]
[]
["◆加点希望"]
["加点希望","第１希望指定"]
[null,{"$f":"$A$13","v":"小学校"},{"$f":"$A$14","v":"中国語"},{"$f":"$A$15","v":"中社会"},{"$f":"$A$16","v":"中数学"},{"$f":"$A$17","v":"中理科"},{"$f":"$A$18","v":"中音楽"},{"$f":"$A$19","v":"中美術"},{"$f":"$A$20","v":"中保体"},{"$f":"$A$21","v":"中技術"},{"$f":"$A$22","v":"中家庭"},{"$f":"$A$23","v":"中英語"},{"$f":"$A$24","v":"高国語"},{"$f":"$A$25","v":"高地公"},{"$f":"$A$26","v":"高数学"},{"$f":"$A$27","v":"高理科"},{"$f":"$A$28","v":"高保体"},{"$f":"$A$29","v":"高音楽"},{"$f":"$A$30","v":"高美術"},{"$f":"$A$31","v":"高書道"},{"$f":"$A$32","v":"高英語"},{"$f":"$A$33","v":"高家庭"},{"$f":"$A$34","v":"高情報"},{"$f":"$A$35","v":"高農業"},{"$f":"$A$36","v":"高工業"},{"$f":"$A$37","v":"高商業"},{"$f":"$A$38","v":"高福祉"},{"$f":"$A$39","v":"高水産"},{"$f":"$A$40","v":"特支校"},{"$f":"$A$41","v":"養教諭"},{"$f":"$A$42","v":"栄教諭"}]
["外国語免許所有","○"]
["英語資格等所有","○","○","○","○","○","○","○","○","○","○","○","○","○","○","○","○","○","○","○","○","○","○","○","○","○","○","○"]
["特別支援免許所有","○","○","○","○","○","○","○","○","○","○","○","○","○","○","○","○","○","○","○","○","○","○","○","○","○","○","○"]
["情報資格等所有","○","○","○","○","○","○","○","○","○","○","○","○","○","○","○","○","○","○","○","○","○","○","○","○","○","○","○","○"]
["情報免許所有",null,null,null,null,null,null,null,null,null,null,null,"○","○","○","○","○","○","○","○","○","○",null,"○","○","○","○","○"]
["国際貢献活動経験","○","○","○","○","○","○","○","○","○","○","○","○","○","○","○","○","○","○","○","○","○","○","○","○","○","○","○","○","○","○"]
[]
[]
["◆実技試験"]
["実技試験","第１希望指定"]
[null,{"$f":"$A$13","v":"小学校"},{"$f":"$A$14","v":"中国語"},{"$f":"$A$15","v":"中社会"},{"$f":"$A$16","v":"中数学"},{"$f":"$A$17","v":"中理科"},{"$f":"$A$18","v":"中音楽"},{"$f":"$A$19","v":"中美術"},{"$f":"$A$20","v":"中保体"},{"$f":"$A$21","v":"中技術"},{"$f":"$A$22","v":"中家庭"},{"$f":"$A$23","v":"中英語"},{"$f":"$A$24","v":"高国語"},{"$f":"$A$25","v":"高地公"},{"$f":"$A$26","v":"高数学"},{"$f":"$A$27","v":"高理科"},{"$f":"$A$28","v":"高保体"},{"$f":"$A$29","v":"高音楽"},{"$f":"$A$30","v":"高美術"},{"$f":"$A$31","v":"高書道"},{"$f":"$A$32","v":"高英語"},{"$f":"$A$33","v":"高家庭"},{"$f":"$A$34","v":"高情報"},{"$f":"$A$35","v":"高農業"},{"$f":"$A$36","v":"高工業"},{"$f":"$A$37","v":"高商業"},{"$f":"$A$38","v":"高福祉"},{"$f":"$A$39","v":"高水産"},{"$f":"$A$40","v":"特支校"},{"$f":"$A$41","v":"養教諭"},{"$f":"$A$42","v":"栄教諭"}]
["実技試験１",null,null,null,null,null,null,null,"○",null,null,null,null,null,null,null,"○"]
["実技試験２",null,null,null,null,null,null,null,"○",null,null,null,null,null,null,null,"○"]

{"sheet":"CODE","index":4,"n_rows":267,"n_cols":16,"rows_kept":267,"cut":false,"hidden":true,"merged":[]}
["志願区分：校種等・教科（コード）","志願区分：校種等・教科（名称）","都道府県（コード）","都道府県（名称）","最終学校（コード）","最終学校（名称）","最終学校（都道府県）","最終学校（種別）","学部（コード）","学部（名称）","職種（コード）","職種（名称）","勤務地（コード）","勤務地（名称）","教員免許：校種・職種（コード）","教員免許：校種・職種（名称）"]
["1","小学校","01","北海道","1001","京都大学","京都府","国立大学法人大学",1,"大学（国公立の教育学部）","01","正式採用の教諭","01","京都府立高等学校",null,"小学"]
["2","中国語","02","青森県","1002","京都教育大学",null,null,2,"大学（１以外）","02","正式採用の養護教諭","02","京都府立特別支援学校",null,"中学"]
["3","中社会","03","岩手県","1003","京都工芸繊維大",null,null,3,"大学院（修士課程）","03","正式採用の事務職員","11","府立中学校",null,"高校"]
["4","中数学","04","宮城県","1101","大阪大学",null,null,4,"大学院（博士課程）","04","正式採用の学校栄養職員","12","公立小・中学校（乙訓教育局管内）",null,"特支"]
["5","中理科","05","秋田県","1102","大阪外国語大学",null,null,5,"大学院（教職大学院）","05","正式採用の実習助手・寄宿舎指導員","13","公立小・中学校（山城教育局管内）",null,"盲学"]
["6","中音楽","06","山形県","1103","大阪教育大学",null,null,6,"大学の専攻科","06","正式採用の栄養教諭","14","公立小・中・義務教育学校（南丹教育局管内）",null,"聾学"]
["7","中美術","07","福島県","1104","神戸大学",null,null,7,"短期大学の学科","08","正式採用のその他の学校職員","15","公立小・中学校（中丹教育局管内）",null,"養学"]
["8","中保体","08","茨城県","1105","奈良教育大学",null,null,8,"その他","21","常勤（任期付・臨時的任用）・非常勤の講師","16","公立小・中学校（丹後教育局管内）",null,"幼稚"]
["9","中技術","09","栃木県","1106","奈良女子大学",null,null,null,null,"23","常勤（任期付・臨時的任用）・非常勤の事務職員","21","京都市立高等学校",null,"養教"]
["10","中家庭","10","群馬県","1107","和歌山大学",null,null,null,null,"24","常勤（任期付・臨時的任用）・非常勤の学校栄養職員","22","京都市立総合支援学校",null,"栄教"]
["11","中英語","11","埼玉県","1108","滋賀大学",null,null,null,null,"25","常勤（任期付・臨時的任用） ・非常勤の実習助手・寄宿舎指導員","23","京都市立小・中・義務教育学校",null,"司書"]
["12","高国語","12","千葉県","1109","兵庫教育大学",null,null,null,null,"27","特別支援学校の介助職員","31","京都府内私立小・中・高等学校",""]
["13","高地公","13","東京都","1110","奈良先端科学技術大学院大学",null,null,null,null,"28","常勤（任期付・臨時的任用） ・非常勤のその他の学校職員","41","他府県・指定都市公立小・中・高・特別支援学校"]
["14","高数学","14","神奈川県","1201","北海道大学",null,null,null,null,"31","民間会社の正社員・正職員","51","京都教育大学附属学校"]
["15","高理科","15","新潟県","1202","北海道教育大学",null,null,null,null,"41","地方公務員（学校職員を除く。）","61","国立大学法人附属小・中・高・特別支援学校"]
["16","高保体","16","富山県","1203","帯広畜産大学",null,null,null,null,"51","国家公務員（学校職員を除く。）","99","その他の勤務地、勤務先"]
["17","高音楽","17","石川県","1301","弘前大学",null,null,null,null,"61","公社・公団等職員"]
["18","高美術","18","福井県","1302","岩手大学",null,null,null,null,"99","その他（学生・アルバイト・自営等）"]
["19","高書道","19","山梨県","1303","東北大学"]
["20","高英語","20","長野県","1304","山形大学"]
["21","高家庭","21","岐阜県","1305","福島大学"]
["22","高情報","22","静岡県","1306","宮城教育大学"]
["23","高農業","23","愛知県","1307","秋田大学"]
["24","高工業","24","三重県","1401","茨城大学"]
["25","高商業","25","滋賀県","1402","筑波大学"]
["26","高福祉","26","京都府","1403","宇都宮大学"]
["27","高水産","27","大阪府","1404","埼玉大学"]
["28","特支校","28","兵庫県","1405","千葉大学"]
["29","養教諭","29","奈良県","1406","東京学芸大学"]
["30","栄教諭","30","和歌山県","1407","東京農工大学"]
[null,null,"31","鳥取県","1408","お茶の水女子大学"]
[null,null,"32","島根県","1409","横浜国立大学"]
[null,null,"33","岡山県","1410","東京海洋大学"]
[null,null,"34","広島県","1411","東京大学"]
[null,null,"35","山口県","1412","一橋大学"]
[null,null,"36","徳島県","1501","山梨大学"]
[null,null,"37","香川県","1502","信州大学"]
[null,null,"38","愛媛県","1503","岐阜大学"]
[null,null,"39","高知県","1504","静岡大学"]
[null,null,"40","福岡県","1505","名古屋大学"]
[null,null,"41","佐賀県","1506","愛知教育大学"]
[null,null,"42","長崎県","1507","名古屋工業大学"]
[null,null,"43","熊本県","1508","三重大学"]
[null,null,"44","大分県","1601","新潟大学"]
[null,null,"45","宮崎県","1602","富山大学"]
[null,null,"46","鹿児島県","1603","金沢大学"]
[null,null,"47","沖縄県","1604","福井大学"]
[null,null,"99","その他","1605","上越教育大学"]
[null,null,null,null,"1701","鳥取大学"]
[null,null,null,null,"1702","島根大学"]
[null,null,null,null,"1703","岡山大学"]
[null,null,null,null,"1704","広島大学"]
[null,null,null,null,"1705","山口大学"]
[null,null,null,null,"1801","徳島大学"]
[null,null,null,null,"1802","愛媛大学"]
[null,null,null,null,"1803","高知大学"]
[null,null,null,null,"1804","鳴門教育大学"]
[null,null,null,null,"1805","香川大学"]
[null,null,null,null,"1901","福岡教育大学"]
[null,null,null,null,"1902","九州大学"]
[null,null,null,null,"1903","九州工業大学"]
[null,null,null,null,"1904","長崎大学"]
[null,null,null,null,"1905","琉球大学"]
[null,null,null,null,"1906","鹿屋体育大学"]
[null,null,null,null,"1907","佐賀大学"]
[null,null,null,null,"1908","熊本大学"]
[null,null,null,null,"1909","大分大学"]
[null,null,null,null,"1910","宮崎大学"]
[null,null,null,null,"1911","鹿児島大学"]
[null,null,null,null,"1999"]
[null,null,null,null,"2001","京都市立芸術大学",null,"公立大学法人大学"]
[null,null,null,null,"2002","京都府立大学"]
[null,null,null,null,"2003","京都府立医科大学"]
[null,null,null,null,"2004","福知山公立大学"]
[null,null,null,null,"2101","大阪市立大学"]
[null,null,null,null,"2102","大阪府立大学"]
[null,null,null,null,"2103","神戸市外国語大学"]
[null,null,null,null,"2104","兵庫県立大学"]
[null,null,null,null,"2105","奈良県立大学"]
[null,null,null,null,"2106","滋賀県立大学"]
[null,null,null,null,"2401","高崎経済大学"]
[null,null,null,null,"2402","東京都立大学"]
[null,null,null,null,"2403","横浜市立大学"]
[null,null,null,null,"2501","都留文科大学"]
[null,null,null,null,"2502","静岡県立大学"]
[null,null,null,null,"2503","愛知県立大学"]
[null,null,null,null,"2504","愛知県立芸術大学"]
[null,null,null,null,"2601","金沢美術工芸大学"]
[null,null,null,null,"2701","山口県立大学"]
[null,null,null,null,"2702","下関市立大学"]
[null,null,null,null,"2801","高知県立大学"]
[null,null,null,null,"2901","北九州市立大学"]
[null,null,null,null,"2999"]
[null,null,null,null,"3001","大谷大学",null,"私立大学"]
[null,null,null,null,"3002","京都外国語大学"]
[null,null,null,null,"3003","京都先端科学大学"]
[null,null,null,null,"3004","京都産業大学"]
[null,null,null,null,"3005","京都女子大学"]
[null,null,null,null,"3006","京都光華女子大学"]
[null,null,null,null,"3007","京都橘大学"]
[null,null,null,null,"3008","同志社大学"]
[null,null,null,null,"3009","同志社女子大学"]
[null,null,null,null,"3010","京都ノートルダム女子大学"]
[null,null,null,null,"3011","花園大学"]
[null,null,null,null,"3012","佛教大学"]
[null,null,null,null,"3013","立命館大学"]
[null,null,null,null,"3014","龍谷大学"]
[null,null,null,null,"3015","京都精華大学"]
[null,null,null,null,"3016","京都文教大学"]
[null,null,null,null,"3017","嵯峨美術大学"]
[null,null,null,null,"3018","京都芸術大学"]
[null,null,null,null,"3019","成美大学"]
[null,null,null,null,"3020","京都華頂大学"]
[null,null,null,null,"3101","大阪音楽大学"]
[null,null,null,null,"3102","大阪学院大学"]
[null,null,null,null,"3103","大阪経済大学"]
[null,null,null,null,"3104","大阪経済法科大学"]
[null,null,null,null,"3105","大阪芸術大学"]
[null,null,null,null,"3106","大阪工業大学"]
[null,null,null,null,"3107","大阪産業大学"]
[null,null,null,null,"3108","大阪樟蔭女子大学"]
[null,null,null,null,"3109","大阪商業大学"]
[null,null,null,null,"3110","大阪体育大学"]
[null,null,null,null,"3111","大阪電気通信大学"]
[null,null,null,null,"3112","大阪大谷大学"]
[null,null,null,null,"3113","追手門学院大学"]
[null,null,null,null,"3114","関西大学"]
[null,null,null,null,"3115","関西外国語大学"]
[null,null,null,null,"3116","近畿大学"]
[null,null,null,null,"3117","四天王寺大学"]
[null,null,null,null,"3118","相愛大学"]
[null,null,null,null,"3119","大阪国際大学"]
[null,null,null,null,"3120","梅花女子大学"]
[null,null,null,null,"3121","阪南大学"]
[null,null,null,null,"3122","桃山学院大学"]
[null,null,null,null,"3123","大阪成蹊大学"]
[null,null,null,null,"3124","関西福祉科学大学"]
[null,null,null,null,"3125","摂南大学"]
[null,null,null,null,"3126","常磐会学園大学"]
[null,null,null,null,"3127","東大阪大学"]
[null,null,null,null,"3128","芦屋大学"]
[null,null,null,null,"3129","聖トマス大学"]
[null,null,null,null,"3130","大手前大学"]
[null,null,null,null,"3131","関西学院大学"]
[null,null,null,null,"3132","甲南大学"]
[null,null,null,null,"3133","甲南女子大学"]
[null,null,null,null,"3134","神戸女学院大学"]
[null,null,null,null,"3135","神戸女子大学"]
[null,null,null,null,"3136","神戸親和女子大学"]
[null,null,null,null,"3137","神戸学院大学"]
[null,null,null,null,"3138","園田学園女子大学"]
[null,null,null,null,"3139","武庫川女子大学"]
[null,null,null,null,"3140","兵庫大学"]
[null,null,null,null,"3141","関西国際大学"]
[null,null,null,null,"3142","姫路獨協大学"]
[null,null,null,null,"3143","帝塚山大学"]
[null,null,null,null,"3144","天理大学"]
[null,null,null,null,"3145","奈良大学"]
[null,null,null,null,"3146","畿央大学"]
[null,null,null,null,"3147","成安造形大学"]
[null,null,null,null,"3148","びわこ成蹊スポーツ大学"]
[null,null,null,null,"3149","奈良学園大学"]
[null,null,null,null,"3150","桃山学院教育大学"]
[null,null,null,null,"3201","札幌大学"]
[null,null,null,null,"3202","札幌学院大学"]
[null,null,null,null,"3203","酪農学園大学"]
[null,null,null,null,"3301","仙台大学"]
[null,null,null,null,"3302","東北学院大学"]
[null,null,null,null,"3303","東北福祉大学"]
[null,null,null,null,"3401","日本工業大学"]
[null,null,null,null,"3402","青山学院大学"]
[null,null,null,null,"3403","亜細亜大学"]
[null,null,null,null,"3404","慶應義塾大学"]
[null,null,null,null,"3405","國學院大学"]
[null,null,null,null,"3406","国士舘大学"]
[null,null,null,null,"3407","駒澤大学","3117","明治大学"]
[null,null,null,null,"3408","順天堂大学"]
[null,null,null,null,"3409","上智大学"]
[null,null,null,null,"3410","成城大学"]
[null,null,null,null,"3411","専修大学"]
[null,null,null,null,"3412","創価大学"]
[null,null,null,null,"3413","大東文化大学"]
[null,null,null,null,"3414","拓殖大学"]
[null,null,null,null,"3415","玉川大学"]
[null,null,null,null,"3416","中央大学"]
[null,null,null,null,"3417","東海大学"]
[null,null,null,null,"3418","東京家政大学"]
[null,null,null,null,"3419","東京女子体育"]
[null,null,null,null,"3420","東京農業大学"]
[null,null,null,null,"3421","東京理科大学"]
[null,null,null,null,"3422","東洋大学"]
[null,null,null,null,"3423","二松學舎大学"]
[null,null,null,null,"3424","日本大学"]
[null,null,null,null,"3425","日本女子体育"]
[null,null,null,null,"3426","日本体育大学"]
[null,null,null,null,"3427","法政大学"]
[null,null,null,null,"3428","武蔵野音楽大"]
[null,null,null,null,"3429","武蔵野大学"]
[null,null,null,null,"3430","武蔵野美術大"]
[null,null,null,null,"3431","明治大学"]
[null,null,null,null,"3432","立教大学"]
[null,null,null,null,"3433","早稲田大学"]
[null,null,null,null,"3434","国際武道大学"]
[null,null,null,null,"3435","帝京大学"]
[null,null,null,null,"3501","岐阜女子大学"]
[null,null,null,null,"3502","愛知大学"]
[null,null,null,null,"3503","愛知学院大学"]
[null,null,null,null,"3504","愛知工業大学"]
[null,null,null,null,"3505","中京大学"]
[null,null,null,null,"3506","至学館大学"]
[null,null,null,null,"3507","名古屋学院大学"]
[null,null,null,null,"3508","名古屋芸術大"]
[null,null,null,null,"3509","南山大学"]
[null,null,null,null,"3510","日本福祉大学"]
[null,null,null,null,"3511","名城大学"]
[null,null,null,null,"3512","椙山女学園大学"]
[null,null,null,null,"3513","岐阜聖徳学園"]
[null,null,null,null,"3514","皇學館大学"]
[null,null,null,null,"3601","金沢工業大学"]
[null,null,null,null,"3602","福井工業大学"]
[null,null,null,null,"3701","岡山理科大学"]
[null,null,null,null,"3702","くらしき作陽大学"]
[null,null,null,null,"3703","ﾉｰﾄﾙﾀﾞﾑ清心"]
[null,null,null,null,"3704","美作大学"]
[null,null,null,null,"3705","広島文教女子"]
[null,null,null,null,"3706","東亜大学"]
[null,null,null,null,"3801","四国大学"]
[null,null,null,null,"3802","四国学院大学"]
[null,null,null,null,"3803","徳島文理大学"]
[null,null,null,null,"3901","福岡大学"]
[null,null,null,null,"3902","南九州大学"]
[null,null,null,null,"3903","九州女子大学"]
[null,null,null,null,"3904","鹿児島国際大学"]
[null,null,null,null,"3999"]
[null,null,null,null,"6001","京都聖母女学院短大",null,"短期大学（短期大学部を含む）"]
[null,null,null,null,"6002","京都女子大学短大部"]
[null,null,null,null,"6003","京都文教短大"]
[null,null,null,null,"6004","成美大学短大部"]
[null,null,null,null,"6005","大谷大学短大部"]
[null,null,null,null,"6006","嵯峨芸術大学短大部"]
[null,null,null,null,"6007","平安女学院大学短大部"]
[null,null,null,null,"6008","京都外国語短大"]
[null,null,null,null,"6009","京都西山短大"]
[null,null,null,null,"6010","池坊短大"]
[null,null,null,null,"6011","華頂短大"]
[null,null,null,null,"6101","滋賀短大"]
[null,null,null,null,"6102","滋賀文教短大"]
[null,null,null,null,"6103","奈良佐保短大"]
[null,null,null,null,"6104","大阪音楽大学短大部"]
[null,null,null,null,"6105","大阪薫英女子"]
[null,null,null,null,"6106","大阪女子短大"]
[null,null,null,null,"6107","大阪成蹊短大"]
[null,null,null,null,"6108","関西女子短大"]
[null,null,null,null,"6109","藍野大学短大部"]
[null,null,null,null,"6110","東大阪大学短大部"]
[null,null,null,null,"6111","四天王寺大学短大部"]
[null,null,null,null,"6112","湊川短大"]
[null,null,null,null,"6113","兵庫大学短大部"]
[null,null,null,null,"6114","武庫川女子大学短大部"]
[null,null,null,null,"6115","鈴鹿短大"]
[null,null,null,null,"6502","飯田女子短大"]
[null,null,null,null,"6999"]
[null,null,null,null,"8101","神戸市看護大学",null,"その他の学校"]
[null,null,null,null,"8102","京都栄養医療専門学校"]
[null,null,null,null,"8103","大手前栄養学"]
[null,null,null,null,"9999"]